strange wine error

Justin Friel jmfriel73 at earthlink.net
Fri Aug 2 07:53:26 PDT 2002


On Fri, 2 Aug 2002 01:17:01 -0500
"DJ Lucas" <dj_me at swbell.net> wrote:

<snip>
>...probably the source
> of your problem, I seen it in the June snapshot, but first or second
> line in the wintest/Makefile says something about including CFLAGS in
> you linker flags..this was obviously an error, comment it out and then
> continue the install.  Should go well for you.  I'm working on a hint,
> but not actively right now.  I'd be pleased to hear back on how you've
> got things configured and how things are running once you get it up
> and goin.  Hit me back, with a copy of the Makefile from winetest/ if
> you can't find what I'm talkin bout.

i had a hard time finding the line that you mentioned, so i am attaching
the makefile from program/winetest 

in the meantime i recompiled perl 5.6.1 according to the thread (except
for applying the patch, since i'm not using gcc 3) at
http://archive.linuxfromscratch.org/mail-archives/lfs-dev/2002/07/0547.html
and ran ldconfig. this did fix the cflags error, but now it seems that
either i am missing some files or wine just cant find them. here is the
output from wineinstall:

gcc -c -I. -I. -I../../include -I../../include `perl -MExtUtils::Embed
-e perl_inc` -O3 -march=i686 -Wall -mpreferred-stack-boundary=2 -fPIC
-DSTRICT -DNONAMELESSUNION -DNONAMELESSSTRUCT `perl -MExtUtils::Embed -e
ccflags` -D_REENTRANT -I/usr/X11R6/include -o winetest.o winetest.c
Can't locate auto/DynaLoader/dl_findfile.al in @INC (@INC contains:
/usr/lib/perl5/5.6.1 /usr/lib/perl5/site_perl/5.6.1
/usr/lib/perl5/site_perl/5.6.1 /usr/lib/perl5/site_perl/5.6.0
/usr/lib/perl5/site_perl .) at /usr/lib/perl5/5.6.1/DynaLoader.pm line
178
Compilation failed in require at /usr/lib/perl5/5.6.1/IO/Handle.pm line
256.
BEGIN failed--compilation aborted at /usr/lib/perl5/5.6.1/IO/Handle.pm
line 256.
Compilation failed in require at /usr/lib/perl5/5.6.1/IO/Seekable.pm
line 101.
BEGIN failed--compilation aborted at /usr/lib/perl5/5.6.1/IO/Seekable.pm
line 101.
Compilation failed in require at /usr/lib/perl5/5.6.1/IO/File.pm line
112.
BEGIN failed--compilation aborted at /usr/lib/perl5/5.6.1/IO/File.pm
line 112.
Compilation failed in require at /usr/lib/perl5/5.6.1/FileHandle.pm line
9.
Compilation failed in require at /usr/lib/perl5/5.6.1/ExtUtils/Embed.pm
line 6.
Compilation failed in require.
BEGIN failed--compilation aborted.
Can't locate auto/DynaLoader/dl_findfile.al in @INC (@INC contains:
/usr/lib/perl5/5.6.1 /usr/lib/perl5/site_perl/5.6.1
/usr/lib/perl5/site_perl/5.6.1 /usr/lib/perl5/site_perl/5.6.0
/usr/lib/perl5/site_perl .) at /usr/lib/perl5/5.6.1/DynaLoader.pm line
178
Compilation failed in require at /usr/lib/perl5/5.6.1/IO/Handle.pm line
256.
BEGIN failed--compilation aborted at /usr/lib/perl5/5.6.1/IO/Handle.pm
line 256.
Compilation failed in require at /usr/lib/perl5/5.6.1/IO/Seekable.pm
line 101.
BEGIN failed--compilation aborted at /usr/lib/perl5/5.6.1/IO/Seekable.pm
line 101.
Compilation failed in require at /usr/lib/perl5/5.6.1/IO/File.pm line
112.
BEGIN failed--compilation aborted at /usr/lib/perl5/5.6.1/IO/File.pm
line 112.
Compilation failed in require at /usr/lib/perl5/5.6.1/FileHandle.pm line
9.
Compilation failed in require at /usr/lib/perl5/5.6.1/ExtUtils/Embed.pm
line 6.
Compilation failed in require.
BEGIN failed--compilation aborted.
winetest.c:27: EXTERN.h: No such file or directory
winetest.c:28: perl.h: No such file or directory
make[2]: *** [winetest.o] Error 1
make[2]: Leaving directory
`/home/justin/src/wine-20020710/programs/winetest'
make[1]: *** [winetest] Error 2
make[1]: Leaving directory `/home/justin/src/wine-20020710/programs'
make: *** [programs] Error 2

Compilation failed, aborting install.

i'm not sure what to do at this point 

justin
 
-- 
Unsubscribe: send email to listar at linuxfromscratch.org
and put 'unsubscribe blfs-support' in the subject header of the message



More information about the blfs-support mailing list