libfam compile error

Oliver Eickenberg oliver at eickenberg.de
Sun Aug 25 07:38:05 PDT 2002


Hello,

compiling libfam-2.9.6 like in BLFS 20020824 leads to the following error:


c++ -DHAVE_CONFIG_H -I. -I. -I.. -I../include 
-DCONFIG_ETC_CONFIG_PATH=\"/usr/etc/fam.conf\"    -g -O2 -c 
RPC_TCP_Connector.c++
c++ -DHAVE_CONFIG_H -I. -I. -I.. -I../include 
-DCONFIG_ETC_CONFIG_PATH=\"/usr/etc/fam.conf\"    -g -O2 -c Scanner.c++
c++ -DHAVE_CONFIG_H -I. -I. -I.. -I../include 
-DCONFIG_ETC_CONFIG_PATH=\"/usr/etc/fam.conf\"    -g -O2 -c Scheduler.c++
Scheduler.c++:37: uninitialized const member `Scheduler::IOTypeInfo::iotype'
Scheduler.c++:38: uninitialized const member `Scheduler::IOTypeInfo::iotype'
make[2]: *** [Scheduler.o] Error 1
make[2]: Leaving directory `/usr/src/fam-2.6.9/fam'
make[1]: *** [all-recursive] Error 1
make[1]: Leaving directory `/usr/src/fam-2.6.9'
make: *** [all-recursive-am] Error 2


I tried this with and without optimization but the result was the same.

Has anyone an idea ?

Greetings, Oliver

-- 
Unsubscribe: send email to listar at linuxfromscratch.org
and put 'unsubscribe blfs-support' in the subject header of the message



More information about the blfs-support mailing list