LFS-6.6, Chapter 6.16 Install GCC, libacl.so.1 not found

Mateusz Kaźmierczak kazik117 at gmail.com
Fri May 28 04:11:45 PDT 2010


Hello,
When I'm try compile with make command I have an error:

libtool: link: ranlib
.libs/libstdc++.a
libtool: link: rm -fr
.libs/libstdc++.lax
libtool: link: ( cd ".libs" && rm -f "libstdc++.la" && ln -s
"../libstdc++.la" "libstdc++.la" )
make[4]: Leaving directory
`/tmp/install/gcc-build/x86_64-unknown-linux-gnu/libstdc++-v3/src'
Making all in po
make[4]: Entering directory
`/tmp/install/gcc-build/x86_64-unknown-linux-gnu/libstdc++-v3/po'
msgfmt -o de.mo ../../../../gcc-4.4.3/libstdc++-v3/po/de.po
msgfmt: error while loading shared libraries: libacl.so.1: cannot open
shared object file: No such file or directory
make[4]: *** [de.mo] Error 127
make[4]: Leaving directory
`/tmp/install/gcc-build/x86_64-unknown-linux-gnu/libstdc++-v3/po'
make[3]: *** [all-recursive] Error 1
make[3]: Leaving directory
`/tmp/install/gcc-build/x86_64-unknown-linux-gnu/libstdc++-v3'
make[2]: *** [all] Error 2
make[2]: Leaving directory
`/tmp/install/gcc-build/x86_64-unknown-linux-gnu/libstdc++-v3'
make[1]: *** [all-target-libstdc++-v3] Error 2
make[1]: Leaving directory `/tmp/install/gcc-build'
make: *** [all] Error 2

How to fix this?
-- 
Mateusz Kaźmierczak
-------------- next part --------------
An HTML attachment was scrubbed...
URL: <http://lists.linuxfromscratch.org/pipermail/lfs-support/attachments/20100528/cc467968/attachment.html>


More information about the lfs-support mailing list